BDBM50407154 CHEMBL2079611
SMILES CCC1CN2CCC1CC2[C@H](O)c1ccnc2ccc(OC)cc12
InChI Key InChIKey=LJOQGZACKSYWCH-WGFDLZGGSA-N
Data  1 KI
  Tab Delimited (TSV)   2D SDfile   Computed 3D by Vconf -m prep SDfile
Find this compound or compounds like it in BindingDB:
Activity Spreadsheet -- Enzyme Inhibition Constant Data from BindingDB
Found 1 hit for monomerid = 50407154
TargetCytochrome P450 2D6(Homo sapiens (Human))
Institut F£R Toxikologie
Curated by ChEMBL
LigandPNGBDBM50407154(CHEMBL2079611)
Affinity DataKi:  4.00E+3nM. Assay description: Inhibitory effect on Bufuralol 1'-hydroxylation by human liver microsomes (Ki = apparent inhibition constant)
In DepthDetails ArticlePubMed