BDBM50407191 CHEMBL2114252
SMILES COC(=O)[C@H]1CSSC[C@@H](NC(C)=O)C(=O)N2CCC[C@@H]2C(=O)N[C@@H](Cc2ccccc2)P(O)(=O)CCC(=O)N2CCC[C@@H]2C(=O)N1
InChI Key InChIKey=QHITXSQLMRRZHM-FXEFVXDJSA-N
Data  1 KI
  Tab Delimited (TSV)   2D SDfile   Computed 3D by Vconf -m prep SDfile
Find this compound or compounds like it in BindingDB:
Activity Spreadsheet -- Enzyme Inhibition Constant Data from BindingDB
Found 1 hit for monomerid = 50407191
TargetCollagenase ColA(Clostridium perfringens)
University Of Athens
Curated by ChEMBL
LigandPNGBDBM50407191(CHEMBL2114252)
Affinity DataKi:  4.50E+4nM. Assay description: Inhibition of bacterial collagenase from corynebacterium rathaii
In DepthDetails ArticlePubMed