BDBM50407481 CHEMBL111446
SMILES COc1ccc(NC(=O)C2C[C@]3(C)CCCC[C@]33O[C@@H]3C2=O)cc1
InChI Key InChIKey=XUSKJHJPCRYORF-ZYSRXQITSA-N
Data  1 IC50
  Tab Delimited (TSV)   2D SDfile   Computed 3D by Vconf -m prep SDfile
Find this compound or compounds like it in BindingDB:
Activity Spreadsheet -- Enzyme Inhibition Constant Data from BindingDB
Found 1 hit for monomerid = 50407481
TargetProtein Tat(Human immunodeficiency virus type 1 (isolate PCV12...)
Sterling Winthrop Pharmaecuticals Research Division
Curated by ChEMBL
LigandPNGBDBM50407481(CHEMBL111446)
Affinity DataIC50:  2.57E+4nM. Assay description: The compound was tested for inhibition of HIV-1 replication in SW480 cells using HIV tat assay
In DepthDetails ArticlePubMed