BDBM50407543 CHEMBL335010
SMILES C(C1Cc2ccccc2C1)N1CCN(CC1)c1cccc2OCCOc12
InChI Key InChIKey=CBDKXYNKQOGHRL-UHFFFAOYSA-N
Data  1 KI
  Tab Delimited (TSV)   2D SDfile   Computed 3D by Vconf -m prep SDfile
Find this compound or compounds like it in BindingDB:
Activity Spreadsheet -- Enzyme Inhibition Constant Data from BindingDB
Found 1 hit for monomerid = 50407543
Target5-hydroxytryptamine receptor 1B(Rattus norvegicus (Rat))
Institut De Recherches Servier
Curated by ChEMBL
LigandPNGBDBM50407543(CHEMBL335010)
Affinity DataKi:  490nM. Assay description: Binding affinity at 5-hydroxytryptamine 1B receptor
In DepthDetails ArticlePubMed