BDBM50407670 CHEMBL145520
SMILES CC(C)[C@H](NC(=O)OCc1ccccc1)C(=O)N[C@@H](CCc1ccccc1)[C@@H](O)[C@@H](NCc1ccc(Cl)cc1)C(=O)N[C@@H](C(C)C)C(=O)NCc1nc2ccccc2[nH]1
InChI Key InChIKey=OLTPFWNWJCDYFP-KMHPXQNHSA-N
Data  1 KI
  Tab Delimited (TSV)   2D SDfile   Computed 3D by Vconf -m prep SDfile
Find this compound or compounds like it in BindingDB:
Activity Spreadsheet -- Enzyme Inhibition Constant Data from BindingDB
Found 1 hit for monomerid = 50407670
TargetGag-Pol polyprotein [489-587](Human immunodeficiency virus type 1)
Sandoz Forschungsinstitut Ges.M.B.H.
Curated by ChEMBL
LigandPNGBDBM50407670(CHEMBL145520)
Affinity DataKi:  17nM. Assay description: Inhibitory activity was determined against HIV type 1 protease
In DepthDetails ArticlePubMed