BDBM50407976 CHEMBL2112764
SMILES C[C@@H](CN=O)[C@H]1CC[C@H]2[C@@H]3CCC4=CC(=O)CC[C@]4(C)[C@H]3CC[C@]12C
InChI Key InChIKey=UCGIQPXNWHJPLT-IJDPAOOOSA-N
Data  2 IC50
  Tab Delimited (TSV)   2D SDfile   Computed 3D by Vconf -m prep SDfile
Find this compound or compounds like it in BindingDB:
Activity Spreadsheet -- Enzyme Inhibition Constant Data from BindingDB
Found 2 hits for monomerid = 50407976
TargetSteroid 17-alpha-hydroxylase/17,20 lyase(Homo sapiens (Human))
University Of Maryland
Curated by ChEMBL
LigandPNGBDBM50407976(CHEMBL2112764)
Affinity DataIC50:  6.97E+3nM. Assay description: Inhibition of human testicular 17-alpha-hydroxylase
In DepthDetails ArticlePubMed
TargetSteroid 17-alpha-hydroxylase/17,20 lyase(Homo sapiens (Human))
University Of Maryland
Curated by ChEMBL
LigandPNGBDBM50407976(CHEMBL2112764)
Affinity DataIC50:  6.97E+3nM. Assay description: Inhibition of human testicular 17-alpha-hydroxylase
In DepthDetails ArticlePubMed