BDBM50408000 CHEMBL357870
SMILES O=C(Nc1cccnc1)N1CCc2cc3[nH]ccc3cc12
InChI Key InChIKey=AZMQHXVJUIAXHL-UHFFFAOYSA-N
Data  1 KI
  Tab Delimited (TSV)   2D SDfile   Computed 3D by Vconf -m prep SDfile
Find this compound or compounds like it in BindingDB:
Activity Spreadsheet -- Enzyme Inhibition Constant Data from BindingDB
Found 1 hit for monomerid = 50408000
Target5-hydroxytryptamine receptor 2C(Rattus norvegicus (Rat))
Smithkline Beecham Pharmaceuticals
Curated by ChEMBL
LigandPNGBDBM50408000(CHEMBL357870)
Affinity DataKi:  126nM. Assay description: Displacement of [3H]mesulergine from rat 5-HT2C receptor expressed in HEK293
In DepthDetails ArticlePubMed