BDBM50408040 RO-054082::Ro-05-4082
SMILES CN1c2ccc(cc2C(=NCC1=O)c1ccccc1Cl)[N+]([O-])=O
InChI Key InChIKey=AZVBJJDUDXZLTM-UHFFFAOYSA-N
Data  1 IC50
  Tab Delimited (TSV)   2D SDfile   Computed 3D by Vconf -m prep SDfile
Find this compound or compounds like it in BindingDB:
Activity Spreadsheet -- Enzyme Inhibition Constant Data from BindingDB
Found 1 hit for monomerid = 50408040
TargetTranslocator protein(Homo sapiens (Human))
Harvard University
Curated by ChEMBL
LigandPNGBDBM50408040(RO-054082 | Ro-05-4082)
Affinity DataIC50:  4.54E+8nM. Assay description: Binding affinity of compound towards Benzodiazepine receptor in a competition assay
In DepthDetails ArticlePubMed