BDBM50408124 CHEMBL34857
SMILES Cc1nc2ccc(CN(CC#C)c3ccc(cc3)C(=O)N[C@@H](CCC(O)=O)C(=O)NC(C)(C)C(O)=O)cc2c(=O)[nH]1
InChI Key InChIKey=YUAIKFXOTPNSNN-QHCPKHFHSA-N
Data  1 KI
  Tab Delimited (TSV)   2D SDfile   Computed 3D by Vconf -m prep SDfile
Find this compound or compounds like it in BindingDB:
Activity Spreadsheet -- Enzyme Inhibition Constant Data from BindingDB
Found 1 hit for monomerid = 50408124
TargetThymidylate synthase(Mus musculus)
The Institute Of Cancer Research
Curated by ChEMBL
LigandPNGBDBM50408124(CHEMBL34857)
Affinity DataKi:  42nM. Assay description: Inhibition of Thymidylate Synthase(TS) from mouse L1210 cells
In DepthDetails ArticlePubMed