BDBM50408274 CHEMBL2112519
SMILES C[C@]12CC[C@H]3[C@@H](CC=C4C[C@@H](O)CC[C@]34C)[C@@H]1CC1O[C@@]21c1cnc[nH]1
InChI Key InChIKey=IACSZJJBLWVDHX-XVMJZOIJSA-N
Data  1 IC50
  Tab Delimited (TSV)   2D SDfile   Computed 3D by Vconf -m prep SDfile
Find this compound or compounds like it in BindingDB:
Activity Spreadsheet -- Enzyme Inhibition Constant Data from BindingDB
Found 1 hit for monomerid = 50408274
TargetSteroid 17-alpha-hydroxylase/17,20 lyase(Homo sapiens (Human))
University Of Maryland
Curated by ChEMBL
LigandPNGBDBM50408274(CHEMBL2112519)
Affinity DataIC50:  430nM. Assay description: Inhibition of human testicular microsomal Cytochrome P450 17A1
In DepthDetails ArticlePubMed