BDBM50408422 CHEMBL2113721
SMILES CCCCN(O)C(=O)Nc1cc(cc(OC)c1OCCSc1ccccc1Br)[C@@H]1CC[C@H](O1)c1cc(OC)c(OC)c(OC)c1
InChI Key InChIKey=ADGAICNUKKFKGZ-UIOOFZCWSA-N
Data  2 IC50
  Tab Delimited (TSV)   2D SDfile   Computed 3D by Vconf -m prep SDfile
Find this compound or compounds like it in BindingDB:
Activity Spreadsheet -- Enzyme Inhibition Constant Data from BindingDB
Found 2 hits for monomerid = 50408422
TargetPolyunsaturated fatty acid 5-lipoxygenase(Rattus norvegicus)
University Of Virginia
Curated by ChEMBL
LigandPNGBDBM50408422(CHEMBL2113721)
Affinity DataIC50:  33nM. Assay description: Inhibition of 5-lipoxygenase mediated conversion of [14C]-arachidonic acid to leukotrienes in RBL-2H3 cells
In DepthDetails ArticlePubMed
TargetPlatelet-activating factor receptor(Homo sapiens (Human))
University Of Virginia
Curated by ChEMBL
LigandPNGBDBM50408422(CHEMBL2113721)
Affinity DataIC50:  23nM. Assay description: Displacement of [3H]-PAF from PAF receptor of human platelet membranes
In DepthDetails ArticlePubMed