BDBM50408451 CHEMBL332139::MEN-10937
SMILES O=C(Cc1ccccc1)N[C@H](Cc1ccc2ccccc2c1)NC(=O)[C@@H]1CCCC[C@@H]1NC(=O)c1c[nH]c2ccccc12
InChI Key InChIKey=LRSIEKVEWAVZDJ-CDSZWMAJSA-N
Data  1 IC50
  Tab Delimited (TSV)   2D SDfile   Computed 3D by Vconf -m prep SDfile
Find this compound or compounds like it in BindingDB:
Activity Spreadsheet -- Enzyme Inhibition Constant Data from BindingDB
Found 1 hit for monomerid = 50408451
TargetSubstance-P receptor(Homo sapiens (Human))
Washington University
Curated by ChEMBL
LigandPNGBDBM50408451(CHEMBL332139 | MEN-10937)
Affinity DataIC50:  316nM. Assay description: Binding affinity was measured against the Tachykinin receptor 1 in human IM-9 cells using [3H]SP as ligand.
In DepthDetails ArticlePubMed