BDBM50408463 CHEMBL333566
SMILES C(N[C@H]1C2CC3CCCC(C2)N3[C@H]1C(c1ccccc1)c1ccccc1)c1ccccc1
InChI Key InChIKey=KQKNMRPRNMBGPX-HCPABCRVSA-N
Data  1 IC50
  Tab Delimited (TSV)   2D SDfile   Computed 3D by Vconf -m prep SDfile
Find this compound or compounds like it in BindingDB:
Activity Spreadsheet -- Enzyme Inhibition Constant Data from BindingDB
Found 1 hit for monomerid = 50408463
TargetSubstance-P receptor(Homo sapiens (Human))
Washington University
Curated by ChEMBL
LigandPNGBDBM50408463(CHEMBL333566)
Affinity DataIC50:  170nM. Assay description: Binding affinity was measured against the Tachykinin receptor 1 in human IM-9 cells using [125I]Bolton-Hunter SP.
In DepthDetails ArticlePubMed