BDBM50408687 CHEMBL2112583
SMILES NC(CCc1cccc2ccccc12)([C@H]1C[C@@H]1C(O)=O)C(O)=O
InChI Key InChIKey=LTNANPWTFHLSJB-INHRHCAVSA-N
Data  2 IC50
  Tab Delimited (TSV)   2D SDfile   Computed 3D by Vconf -m prep SDfile
Find this compound or compounds like it in BindingDB:
Activity Spreadsheet -- Enzyme Inhibition Constant Data from BindingDB
Found 2 hits for monomerid = 50408687
TargetMetabotropic glutamate receptor 3(Homo sapiens (Human))
Eli Lilly
Curated by ChEMBL
LigandPNGBDBM50408687(CHEMBL2112583)
Affinity DataIC50:  470nM. Assay description: Ability to block 1S,3R-ACPD-induced inhibition of forskolin stimulated cyclic-AMP in non-neuronal cell line expressing human Metabotropic glutamate r...
In DepthDetails ArticlePubMed
TargetMetabotropic glutamate receptor 2(Homo sapiens (Human))
Eli Lilly
Curated by ChEMBL
LigandPNGBDBM50408687(CHEMBL2112583)
Affinity DataIC50:  240nM. Assay description: Ability to block 1S,3R-ACPD-induced inhibition of forskolin stimulated cyclic-AMP in non-neuronal cell line expressing human Metabotropic glutamate r...
In DepthDetails ArticlePubMed