BDBM50408755 CHEMBL2145442
SMILES CC(C)CCCOCCCc1cnc[nH]1
InChI Key InChIKey=WTEZPXXKCYTAGX-UHFFFAOYSA-N
Data  1 KI  1 EC50
  Tab Delimited (TSV)   2D SDfile   Computed 3D by Vconf -m prep SDfile
Find this compound or compounds like it in BindingDB:
Activity Spreadsheet -- Enzyme Inhibition Constant Data from BindingDB
Found 2 hits for monomerid = 50408755
TargetHistamine H3 receptor(Rattus norvegicus (rat))
Freie UniversitäT Berlin
Curated by ChEMBL
LigandPNGBDBM50408755(CHEMBL2145442)
Affinity DataKi:  9.40nM. Assay description: In vitro binding affinity against histamine H3 receptor from synaptosomes of rat cerebral cortex
In DepthDetails ArticlePubMed
TargetHistamine H3 receptor(Rattus norvegicus (rat))
Freie UniversitäT Berlin
Curated by ChEMBL
LigandPNGBDBM50408755(CHEMBL2145442)
Affinity DataEC50:  0.25nM. Assay description: In vitro intrinsic activity against histamine H3 receptor from synaptosomes of rat cerebral cortex
In DepthDetails ArticlePubMed