BDBM50408877 CHEMBL412127
SMILES Cc1nc2cc3CCC(N(CC#C)c4ccc(cc4)C(=O)N[C@@H](CCc4nnnn4CCCC(O)=O)C(O)=O)c3cc2c(=O)[nH]1
InChI Key InChIKey=OKGZNBAJEZRMEG-QSAPEBAKSA-N
Data  1 KI
  Tab Delimited (TSV)   2D SDfile   Computed 3D by Vconf -m prep SDfile
Find this compound or compounds like it in BindingDB:
Activity Spreadsheet -- Enzyme Inhibition Constant Data from BindingDB
Found 1 hit for monomerid = 50408877
TargetThymidylate synthase(Mus musculus)
The Institute Of Cancer Research
Curated by ChEMBL
LigandPNGBDBM50408877(CHEMBL412127)
Affinity DataKi:  2nM. Assay description: Compound was tested for the binding affinity against thymidylate synthase from L1210 mouse leukemia cells; value given as 0.9, 2.0
In DepthDetails ArticlePubMed