BDBM50408899 CHEMBL300607
SMILES NCCCCNC(=O)CCc1cn(C2CC(N=[N+]=[N-])C(CO)O2)c(=O)[nH]c1=O
InChI Key InChIKey=ILSUSIIBPRNDDX-UHFFFAOYSA-N
Data  1 EC50
  Tab Delimited (TSV)   2D SDfile   Computed 3D by Vconf -m prep SDfile
Find this compound or compounds like it in BindingDB:
Activity Spreadsheet -- Enzyme Inhibition Constant Data from BindingDB
Found 1 hit for monomerid = 50408899
TargetReverse transcriptase/RNaseH(Human immunodeficiency virus 1)
Institut Curie
Curated by ChEMBL
LigandPNGBDBM50408899(CHEMBL300607)
Affinity DataEC50: >1.00E+5nM. Assay description: Effective concentration required to achieve 50% inhibition of HIV-1 LAI replication in human T4 lymphoblastoid CEM-SS cells.
In DepthDetails ArticlePubMed