BDBM50409234 CHEMBL89045
SMILES CC(C)C[C@@H]1[C@H](CCCOC(=O)NCCCC[C@H](NC1=O)C(=O)NCC(=O)N1CCC(O)CC1)C(=O)NO
InChI Key InChIKey=FSVQBLXZMJFWFD-ZCNNSNEGSA-N
Data  1 IC50
  Tab Delimited (TSV)   2D SDfile   Computed 3D by Vconf -m prep SDfile
Find this compound or compounds like it in BindingDB:
Activity Spreadsheet -- Enzyme Inhibition Constant Data from BindingDB
Found 1 hit for monomerid = 50409234
TargetDisintegrin and metalloproteinase domain-containing protein 17(Homo sapiens (Human))
Dupont Pharmaceuticals
Curated by ChEMBL
LigandPNGBDBM50409234(CHEMBL89045)
Affinity DataIC50:  280nM. Assay description: Inhibition of LPS-stimulated TNF-alpha release in human whole blood
In DepthDetails ArticlePubMed