BDBM50409346 CHEMBL415397
SMILES CC[C@H](C)[C@H](NC(=O)[C@@H](NC(=O)[C@H](Cc1ccc(O)cc1)NC(=O)CNC(=O)[C@H](CCSC)NC(=O)[C@H](Cc1ccccc1)NC(=O)[C@H](CC(N)=O)NC(=O)[C@H](CC(C)C)NC(=O)[C@@H](N)CO)C(C)C)C(O)=O
InChI Key InChIKey=LSABLLFLGVNCGX-PVZAMDIGSA-N
Data  1 IC50
  Tab Delimited (TSV)   2D SDfile   Computed 3D by Vconf -m prep SDfile
Find this compound or compounds like it in BindingDB:
Activity Spreadsheet -- Enzyme Inhibition Constant Data from BindingDB
Found 1 hit for monomerid = 50409346
TargetHLA class I histocompatibility antigen, A alpha chain(Homo sapiens (Human))
Edward Jenner Institute For Vaccine Research
Curated by ChEMBL
LigandPNGBDBM50409346(CHEMBL415397)
Affinity DataIC50:  1.32E+3nM. Assay description: MHC class I HLA-A*0201 binding affinity assayed by based inhibition of binding of a radiolabeled standard peptide (FLPSDYFPSV)
In DepthDetails ArticlePubMed