BDBM50409415 CHEMBL405270
SMILES CC(C)C[C@H](NC(=O)[C@@H](N)Cc1ccc(O)cc1)C(=O)N[C@@H](Cc1c[nH]c2ccccc12)C(=O)N1CCC[C@H]1C(=O)NCC(=O)N1CCC[C@H]1C(=O)N[C@@H](C(C)C)C(=O)N[C@@H]([C@@H](C)O)C(=O)N[C@@H](C(C)C)C(O)=O
InChI Key InChIKey=XFORHASIKUIEPW-SQDDJZLWSA-N
Data  1 IC50
  Tab Delimited (TSV)   2D SDfile   Computed 3D by Vconf -m prep SDfile
Find this compound or compounds like it in BindingDB:
Activity Spreadsheet -- Enzyme Inhibition Constant Data from BindingDB
Found 1 hit for monomerid = 50409415
TargetHLA class I histocompatibility antigen, A alpha chain(Homo sapiens (Human))
Edward Jenner Institute For Vaccine Research
Curated by ChEMBL
LigandPNGBDBM50409415(CHEMBL405270)
Affinity DataIC50:  7.5nM. Assay description: MHC class I HLA-A*0201 binding affinity assayed by based inhibition of binding of a radiolabeled standard peptide (FLPSDYFPSV)
In DepthDetails ArticlePubMed