BDBM50409515 CHEMBL110948::QF-0610B
SMILES Fc1ccc2c(noc2c1)C1CCN(CCC2CCc3sccc3C2=O)CC1
InChI Key InChIKey=YXDUNIOKKMVMKO-UHFFFAOYSA-N
Data  5 KI
  Tab Delimited (TSV)   2D SDfile   Computed 3D by Vconf -m prep SDfile
Find this compound or compounds like it in BindingDB:
Activity Spreadsheet -- Enzyme Inhibition Constant Data from BindingDB
Found 5 hits for monomerid = 50409515
Target5-hydroxytryptamine receptor 2A(Rattus norvegicus (rat))
University Of Perugia
Curated by ChEMBL
LigandPNGBDBM50409515(CHEMBL110948 | QF-0610B)
Affinity DataKi:  2.80nM. Assay description: Kinetic inhibition constant evaluated by measuring serotonergic activity
In DepthDetails ArticlePubMed
Target5-hydroxytryptamine receptor 2A(Rattus norvegicus (rat))
University Of Perugia
Curated by ChEMBL
LigandPNGBDBM50409515(CHEMBL110948 | QF-0610B)
Affinity DataKi:  2.80nM. Assay description: Compound was tested in vitro for its binding affinity towards 5-hydroxytryptamine 2A receptor from rat frontal cortex using [3H]-ketanserin as radiol...
In DepthDetails ArticlePubMed
TargetD(2) dopamine receptor(Rattus norvegicus (rat))
Universidad De Santiago
Curated by ChEMBL
LigandPNGBDBM50409515(CHEMBL110948 | QF-0610B)
Affinity DataKi:  46nM. Assay description: In vitro ability to displace [3H]spiperone binding from dopamine receptor D2 in rat striatal membrane.
In DepthDetails ArticlePubMed
Target5-hydroxytryptamine receptor 2C(Homo sapiens (Human))
Universidad De Santiago
Curated by ChEMBL
LigandPNGBDBM50409515(CHEMBL110948 | QF-0610B)
Affinity DataKi:  126nM. Assay description: In vitro ability to displace [3H]mesulergine binding from 5-hydroxytryptamine 2C receptor from bovine choroid plexus.
In DepthDetails ArticlePubMed
TargetD(1A) dopamine receptor(RAT)
Universidad De Santiago
Curated by ChEMBL
LigandPNGBDBM50409515(CHEMBL110948 | QF-0610B)
Affinity DataKi:  295nM. Assay description: In vitro ability to displace [3H]SCH-23390 binding from Dopamine 1 (D1) receptor in rat striatal membrane.
In DepthDetails ArticlePubMed