BDBM50409591 CHEMBL2028922
SMILES CC(C)[C@H](NC(=O)NNC(=O)[C@H](Cc1ccccc1)NC(C)=O)C(=O)NCc1ccccc1
InChI Key InChIKey=PEGQWNGJSDVTNZ-SFTDATJTSA-N
Data  1 KI
  Tab Delimited (TSV)   2D SDfile   Computed 3D by Vconf -m prep SDfile
Find this compound or compounds like it in BindingDB:
Activity Spreadsheet -- Enzyme Inhibition Constant Data from BindingDB
Found 1 hit for monomerid = 50409591
TargetPapain(Carica papaya)
University Of Gda£?Sk
Curated by ChEMBL
LigandPNGBDBM50409591(CHEMBL2028922)
Affinity DataKi:  30nM. Assay description: In vitro inhibition of papain.
In DepthDetails ArticlePubMed