BDBM50409686 CHEMBL173068
SMILES CNc1nc(C)nc2n(cnc12)C1CC(OP(O)(O)=O)C(COP(O)(O)=O)O1
InChI Key InChIKey=PFVYXNYRQBWSTG-UHFFFAOYSA-N
Data  1 Kd
  Tab Delimited (TSV)   2D SDfile   Computed 3D by Vconf -m prep SDfile
Find this compound or compounds like it in BindingDB:
Activity Spreadsheet -- Enzyme Inhibition Constant Data from BindingDB
Found 1 hit for monomerid = 50409686
TargetP2Y purinoceptor 1(Homo sapiens (Human))
Universit£
Curated by ChEMBL
LigandPNGBDBM50409686(CHEMBL173068)
Affinity DataKd:  77.6nM. Assay description: pA2 value was evaluated against P2Y purinoceptor 1
In DepthDetails ArticlePubMed