BDBM50409803 CHEMBL1907704
SMILES CCN1CCC[C@H]1CNC(=O)c1c(OC)c(CC)cc(OC)c1OC
InChI Key InChIKey=CNYFTYULLUBARK-AWEZNQCLSA-N
Data  1 IC50
  Tab Delimited (TSV)   2D SDfile   Computed 3D by Vconf -m prep SDfile
Find this compound or compounds like it in BindingDB:
Activity Spreadsheet -- Enzyme Inhibition Constant Data from BindingDB
Found 1 hit for monomerid = 50409803
TargetPolymerase acidic protein(Hepatitis C virus)
Roche Discovery Welwyn
Curated by ChEMBL
LigandPNGBDBM50409803(CHEMBL1907704)
Affinity DataIC50:  3.20E+4nM. Assay description: Inhibitory concentration against cap-dependent endonuclease activity of influenza A/PR/8/34 RNP
In DepthDetails ArticlePubMed