BDBM50410303 CHEMBL361847
SMILES CC(=O)N1c2ccc(NC(=O)c3ccc(cc3)C(F)(F)F)cc2C(C)(CC1(C)C)c1ccccc1
InChI Key InChIKey=UWCKSOOAWYHHJL-UHFFFAOYSA-N
Data  1 IC50
  Tab Delimited (TSV)   2D SDfile   Computed 3D by Vconf -m prep SDfile
Find this compound or compounds like it in BindingDB:
Activity Spreadsheet -- Enzyme Inhibition Constant Data from BindingDB
Found 1 hit for monomerid = 50410303
TargetFollicle-stimulating hormone receptor(Homo sapiens (Human))
Research And Development
Curated by ChEMBL
LigandPNGBDBM50410303(CHEMBL361847)
Affinity DataIC50:  7nM. Assay description: In vitro inhibition of maximum response on CHO-K1 cells expressing human Follicle stimulating hormone receptor
In DepthDetails ArticlePubMed