BDBM50410346 CHEMBL372471
SMILES CC(C)N1CCC(CC1)Oc1ccc(CN2CCN(C)CC2)cc1
InChI Key InChIKey=VECSKFSGEBXSKE-UHFFFAOYSA-N
Data  1 KI
  Tab Delimited (TSV)   2D SDfile   Computed 3D by Vconf -m prep SDfile
Find this compound or compounds like it in BindingDB:
Activity Spreadsheet -- Enzyme Inhibition Constant Data from BindingDB
Found 1 hit for monomerid = 50410346
TargetHistamine H3 receptor(Homo sapiens (Human))
Johnson & Johnson Pharmaceutical Research And Development
Curated by ChEMBL
LigandPNGBDBM50410346(CHEMBL372471)
Affinity DataKi:  0.741nM. Assay description: Mean binding affinity for human H3 receptor
In DepthDetails ArticlePubMed