BDBM50410519 CHEMBL194458
SMILES OC(=O)COc1cc(Cl)c(Cl)cc1Cl
InChI Key InChIKey=SMYMJHWAQXWPDB-UHFFFAOYSA-N
Data  1 IC50
PDB links: 2 PDB IDs match this monomer.
  Tab Delimited (TSV)   2D SDfile   Computed 3D by Vconf -m prep SDfile
Find this compound or compounds like it in BindingDB:
Activity Spreadsheet -- Enzyme Inhibition Constant Data from BindingDB
Found 1 hit for monomerid = 50410519
TargetAndrogen receptor(Rattus norvegicus (Rat))
University Of Basel
Curated by ChEMBL
LigandPNGBDBM50410519(CHEMBL194458)
Affinity DataIC50:  4.57E+5nM. Assay description: Inhibitory concentration against recombinant rat androgen receptor expressed in Escherichia coli using [3H]methyltrienolone (R 1881)
In DepthDetails ArticlePubMed