BDBM50410527 CHEMBL194858
SMILES C[C@]12CC[C@H]3[C@@H](CC[C@H]4C[C@@H](O)CC[C@]34C)[C@@H]1CCC2O
InChI Key InChIKey=CBMYJHIOYJEBSB-NMNWSMPISA-N
Data  1 IC50
  Tab Delimited (TSV)   2D SDfile   Computed 3D by Vconf -m prep SDfile
Find this compound or compounds like it in BindingDB:
Activity Spreadsheet -- Enzyme Inhibition Constant Data from BindingDB
Found 1 hit for monomerid = 50410527
TargetAndrogen receptor(Rattus norvegicus (Rat))
University Of Basel
Curated by ChEMBL
LigandPNGBDBM50410527(CHEMBL194858)
Affinity DataIC50:  135nM. Assay description: Inhibitory concentration against recombinant rat androgen receptor expressed in Escherichia coli using [3H]methyltrienolone (R 1881)
In DepthDetails ArticlePubMed