BDBM50410753 CHEMBL199353
SMILES COc1cc(ccc1OCC(=O)Nc1ccc(F)cc1)-c1cc2n(C)c(=O)n(C)c(=O)c2[nH]1
InChI Key InChIKey=YZADYLANTDJQCH-UHFFFAOYSA-N
Data  2 KI
  Tab Delimited (TSV)   2D SDfile   Computed 3D by Vconf -m prep SDfile
Find this compound or compounds like it in BindingDB:
Activity Spreadsheet -- Enzyme Inhibition Constant Data from BindingDB
Found 2 hits for monomerid = 50410753
TargetAdenosine receptor A2a(Homo sapiens (Human))
Universit£
Curated by ChEMBL
LigandPNGBDBM50410753(CHEMBL199353)
Affinity DataKi:  45.7nM. Assay description: Binding affinity to recombinant human adenosine A2A receptor
In DepthDetails ArticlePubMed
TargetAdenosine receptor A2b(Homo sapiens (Human))
Universit£
Curated by ChEMBL
LigandPNGBDBM50410753(CHEMBL199353)
Affinity DataKi:  145nM. Assay description: Binding affinity to recombinant human adenosine A2B receptor
In DepthDetails ArticlePubMed