BDBM50410909 CHEMBL207591::PSI
SMILES CC[C@H](C)[C@H](NC(=O)OCc1ccccc1)C(=O)N[C@@H](CCC(=O)OC(C)(C)C)C(=O)N[C@@H](C)C(=O)N[C@@H](CC(C)C)C=O
InChI Key InChIKey=TYFTWYMXUWCOOB-YICLCXKGSA-N
Data  2 KI  1 IC50
  Tab Delimited (TSV)   2D SDfile   Computed 3D by Vconf -m prep SDfile
Find this compound or compounds like it in BindingDB:
Activity Spreadsheet -- Enzyme Inhibition Constant Data from BindingDB
Found 3 hits for monomerid = 50410909
TargetProteasome subunit beta type-2(Homo sapiens (Human))
Celera
Curated by ChEMBL
LigandPNGBDBM50410909(CHEMBL207591 | PSI)
Affinity DataKi:  2.70E+3nM. Assay description: Inhibition of trypsin-like proteasome activity of human 20S proteasome
In DepthDetails ArticlePubMed
TargetProteasome subunit beta type-1(Homo sapiens (Human))
Celera
Curated by ChEMBL
LigandPNGBDBM50410909(CHEMBL207591 | PSI)
Affinity DataKi:  1.40E+4nM. Assay description: Inhibition of post glutamyl peptide hydrolase-like proteasome activity of human 20S proteasome
In DepthDetails ArticlePubMed
TargetReplicase polyprotein 1ab(2019-nCoV)
Michigan State University
LigandPNGBDBM50410909(CHEMBL207591 | PSI)
Affinity DataIC50:  1.04E+4nM. Assay description: This is a review article. Please point to the original journal.
In DepthDetails ArticlePubMed