BDBM50411029 CHEMBL212312
SMILES Cc1noc(=O)c2ccc(NC(=O)C(O)(CC3CCCc4c(Br)cccc34)C(F)(F)F)cc12
InChI Key InChIKey=GIVISDRWZOTJRD-UHFFFAOYSA-N
Data  3 IC50
  Tab Delimited (TSV)   2D SDfile   Computed 3D by Vconf -m prep SDfile
Find this compound or compounds like it in BindingDB:
Activity Spreadsheet -- Enzyme Inhibition Constant Data from BindingDB
Found 3 hits for monomerid = 50411029
TargetGlucocorticoid receptor(Homo sapiens (Human))
Glaxosmithkline
Curated by ChEMBL
LigandPNGBDBM50411029(CHEMBL212312)
Affinity DataIC50:  794nM. Assay description: Activity at GR assessed as ability to antagonize dexamethasone-induced MMTV luciferase reporter gene transactivation in human A549 cellsChecked by Author
In DepthDetails ArticlePubMed
TargetGlucocorticoid receptor(Homo sapiens (Human))
Glaxosmithkline
Curated by ChEMBL
LigandPNGBDBM50411029(CHEMBL212312)
Affinity DataIC50:  25.1nM. Assay description: Inhibition of fluorescent-labeled Dexamethasone binding to GRChecked by Author
In DepthDetails ArticlePubMed
TargetGlucocorticoid receptor(Homo sapiens (Human))
Glaxosmithkline
Curated by ChEMBL
LigandPNGBDBM50411029(CHEMBL212312)
Affinity DataIC50: <1.00E+3nM. Assay description: Agonist activity at GR assessed as NF-kappaB-mediated transrepression of secreted placental alkaline phosphatase gene in human A549 cellsChecked by Author
In DepthDetails ArticlePubMed