BDBM50411277 CHEMBL268184
SMILES COC(=O)c1cccc(n1)-c1cnc(o1)C(O)CCCCCCc1ccccc1
InChI Key InChIKey=XGZJNABEONZYBZ-UHFFFAOYSA-N
Data  1 KI
  Tab Delimited (TSV)   2D SDfile   Computed 3D by Vconf -m prep SDfile
Find this compound or compounds like it in BindingDB:
Activity Spreadsheet -- Enzyme Inhibition Constant Data from BindingDB
Found 1 hit for monomerid = 50411277
TargetFatty-acid amide hydrolase 1(Homo sapiens (Human))
The Scripps Research Institute
Curated by ChEMBL
LigandPNGBDBM50411277(CHEMBL268184)
Affinity DataKi:  2.30E+3nM. Assay description: Inhibition of rat recombinant FAAH expressed in Escherichia coli by [14C]oleamide breakdown
In DepthDetails ArticlePubMed