BDBM50411285 CHEMBL219943
SMILES NC(=O)c1ccc(nc1)-c1cnc(o1)C(=O)CCCCCCc1ccccc1
InChI Key InChIKey=LHTBNQUBJBTNLK-UHFFFAOYSA-N
Data  1 KI
  Tab Delimited (TSV)   2D SDfile   Computed 3D by Vconf -m prep SDfile
Find this compound or compounds like it in BindingDB:
Activity Spreadsheet -- Enzyme Inhibition Constant Data from BindingDB
Found 1 hit for monomerid = 50411285
TargetFatty-acid amide hydrolase 1(Homo sapiens (Human))
The Scripps Research Institute
Curated by ChEMBL
LigandPNGBDBM50411285(CHEMBL219943)
Affinity DataKi:  1.20nM. Assay description: Inhibition of rat recombinant FAAH expressed in Escherichia coli by [14C]oleamide breakdown
In DepthDetails ArticlePubMed