BDBM50411300 CHEMBL219741
SMILES OC(CCCCCCc1ccccc1)c1ncc(o1)-c1cccc(n1)C(O)=O
InChI Key InChIKey=WLABLOBUPDZBNJ-UHFFFAOYSA-N
Data  1 KI
  Tab Delimited (TSV)   2D SDfile   Computed 3D by Vconf -m prep SDfile
Find this compound or compounds like it in BindingDB:
Activity Spreadsheet -- Enzyme Inhibition Constant Data from BindingDB
Found 1 hit for monomerid = 50411300
TargetFatty-acid amide hydrolase 1(Homo sapiens (Human))
The Scripps Research Institute
Curated by ChEMBL
LigandPNGBDBM50411300(CHEMBL219741)
Affinity DataKi: >1.00E+4nM. Assay description: Inhibition of rat recombinant FAAH expressed in Escherichia coli by [14C]oleamide breakdown
In DepthDetails ArticlePubMed