BDBM50411318 CHEMBL2096854
SMILES CC#CCOc1ccc(cc1)S(=O)[C@H](C(=O)NO)c1ccccc1
InChI Key InChIKey=LMLJZJGMFKPKNY-KEJDIYNNSA-N
Data  4 IC50
  Tab Delimited (TSV)   2D SDfile   Computed 3D by Vconf -m prep SDfile
Find this compound or compounds like it in BindingDB:
Activity Spreadsheet -- Enzyme Inhibition Constant Data from BindingDB
Found 4 hits for monomerid = 50411318
TargetInterstitial collagenase(Homo sapiens (Human))
Wyeth Research
Curated by ChEMBL
LigandPNGBDBM50411318(CHEMBL2096854)
Affinity DataIC50: >1.00E+4nM. Assay description: Inhibition of MMP1
In DepthDetails ArticlePubMed
TargetDisintegrin and metalloproteinase domain-containing protein 17(Homo sapiens (Human))
Wyeth Research
Curated by ChEMBL
LigandPNGBDBM50411318(CHEMBL2096854)
Affinity DataIC50:  74nM. Assay description: Inhibition of TACE
In DepthDetails ArticlePubMed
TargetCollagenase 3(Homo sapiens (Human))
Wyeth Research
Curated by ChEMBL
LigandPNGBDBM50411318(CHEMBL2096854)
Affinity DataIC50: >1.00E+4nM. Assay description: Inhibition of MMP13
In DepthDetails ArticlePubMed
TargetMatrix metalloproteinase-9(Homo sapiens (Human))
Wyeth Research
Curated by ChEMBL
LigandPNGBDBM50411318(CHEMBL2096854)
Affinity DataIC50: >1.00E+4nM. Assay description: Inhibition of MMP9
In DepthDetails ArticlePubMed