BDBM50411337 CHEMBL390276
SMILES Cc1ccccc1C(=O)CN1c2ccccc2C(=NN(CC(=O)Nc2cccc(c2)C(O)=O)C1=O)C1CCCCC1
InChI Key InChIKey=AZYWHZJBCDCHPW-UHFFFAOYSA-N
Data  3 KI
  Tab Delimited (TSV)   2D SDfile   Computed 3D by Vconf -m prep SDfile
Find this compound or compounds like it in BindingDB:
Activity Spreadsheet -- Enzyme Inhibition Constant Data from BindingDB
Found 3 hits for monomerid = 50411337
TargetGastrin/cholecystokinin type B receptor(Homo sapiens (Human))
James Black Foundation
Curated by ChEMBL
LigandPNGBDBM50411337(CHEMBL390276)
Affinity DataKi:  7.60nM. Assay description: Displacement of [3H]BH-CCK-8S from human recombinant CCK2 receptor expressed in NIH3T3 cellsChecked by Author
In DepthDetails ArticlePubMed
TargetGastrin/cholecystokinin type B receptor(Dog)
James Black Foundation
Curated by ChEMBL
LigandPNGBDBM50411337(CHEMBL390276)
Affinity DataKi:  26nM. Assay description: Displacement of [125I]BH-CCK8-8S from CCK2 receptor in canine gastric mucosaChecked by Author
In DepthDetails ArticlePubMed
TargetCholecystokinin receptor type A(Homo sapiens (Human))
James Black Foundation
Curated by ChEMBL
LigandPNGBDBM50411337(CHEMBL390276)
Affinity DataKi: <1.00E+4nM. Assay description: Displacement of [3H]L-364718 from human recombinant CCK1 receptor expressed in PC3 cellsChecked by Author
In DepthDetails ArticlePubMed