BDBM50411555 CHEMBL241488
SMILES NC(=O)Cc1c[nH]c2ccc(cc12)-c1cccc(F)c1
InChI Key InChIKey=ZVTFOPHSFKWROP-UHFFFAOYSA-N
Data  1 IC50
  Tab Delimited (TSV)   2D SDfile   Computed 3D by Vconf -m prep SDfile
Find this compound or compounds like it in BindingDB:
Activity Spreadsheet -- Enzyme Inhibition Constant Data from BindingDB
Found 1 hit for monomerid = 50411555
TargetProtein-S-isoprenylcysteine O-methyltransferase(Homo sapiens (Human))
National University Of Singapore
Curated by ChEMBL
LigandPNGBDBM50411555(CHEMBL241488)
Affinity DataIC50:  3.98E+4nM. Assay description: Inhibition of ICMT expressed in Sf9 cells
In DepthDetails ArticlePubMed