BDBM50411594 CHEMBL2021529
SMILES C[C@@H]1CN(Cc2ccc(n12)C(F)(F)F)C(=O)C[C@H](N)Cc1cc(F)c(F)cc1F
InChI Key InChIKey=YAKRDMIJMKTZDY-ZYHUDNBSSA-N
Data  5 IC50
  Tab Delimited (TSV)   2D SDfile   Computed 3D by Vconf -m prep SDfile
Find this compound or compounds like it in BindingDB:
Activity Spreadsheet -- Enzyme Inhibition Constant Data from BindingDB
Found 5 hits for monomerid = 50411594
TargetXaa-Pro aminopeptidase 1(Homo sapiens (Human))
Merck Research Laboratories
Curated by ChEMBL
LigandPNGBDBM50411594(CHEMBL2021529)
Affinity DataIC50: >1.00E+4nM. Assay description: Inhibition of amino peptidase P
In DepthDetails ArticlePubMed
TargetDipeptidyl peptidase 8(Homo sapiens (Human))
Merck Research Laboratories
Curated by ChEMBL
LigandPNGBDBM50411594(CHEMBL2021529)
Affinity DataIC50:  3.30E+4nM. Assay description: Inhibition of DPP8
In DepthDetails ArticlePubMed
TargetProlyl endopeptidase FAP(Homo sapiens (Human))
Merck Research Laboratories
Curated by ChEMBL
LigandPNGBDBM50411594(CHEMBL2021529)
Affinity DataIC50: >1.00E+4nM. Assay description: Inhibition of FAP
In DepthDetails ArticlePubMed
TargetDipeptidyl peptidase 9(Homo sapiens (Human))
Merck Research Laboratories
Curated by ChEMBL
LigandPNGBDBM50411594(CHEMBL2021529)
Affinity DataIC50:  5.30E+4nM. Assay description: Inhibition of DPP9
In DepthDetails ArticlePubMed
TargetXaa-Pro dipeptidase(Homo sapiens (Human))
Merck Research Laboratories
Curated by ChEMBL
LigandPNGBDBM50411594(CHEMBL2021529)
Affinity DataIC50: >1.00E+4nM. Assay description: Inhibition of prolidase
In DepthDetails ArticlePubMed