BDBM50411607 CHEMBL253428
SMILES CC[C@@H](C)[C@H](S)C(=O)N[C@@H](Cc1ccc2ccccc2c1)C(O)=O
InChI Key InChIKey=DOLNCCYFNWYJPI-DQYPLSBCSA-N
Data  2 KI
  Tab Delimited (TSV)   2D SDfile   Computed 3D by Vconf -m prep SDfile
Find this compound or compounds like it in BindingDB:
Activity Spreadsheet -- Enzyme Inhibition Constant Data from BindingDB
Found 2 hits for monomerid = 50411607
TargetNeprilysin(Homo sapiens (Human))
Glaxosmithkline
Curated by ChEMBL
LigandPNGBDBM50411607(CHEMBL253428)
Affinity DataKi:  46nM. Assay description: Inhibition of human recombinant NEP by fluorescence assay
In DepthDetails ArticlePubMed
TargetCarboxypeptidase A1(Homo sapiens (Human))
Glaxosmithkline
Curated by ChEMBL
LigandPNGBDBM50411607(CHEMBL253428)
Affinity DataKi:  7.20E+3nM. Assay description: Inhibition of human recombinant CpA by fluorescence assay
In DepthDetails ArticlePubMed