BDBM50411656 CHEMBL272378
SMILES CCc1nc2cc3CCN(CCSc4nnc(-c5cccc6nc(C)ccc56)n4C)CCc3c(Br)c2o1
InChI Key InChIKey=YGOJZWAMJUGUJD-UHFFFAOYSA-N
Data  3 KI  1 IC50
  Tab Delimited (TSV)   2D SDfile   Computed 3D by Vconf -m prep SDfile
Find this compound or compounds like it in BindingDB:
Activity Spreadsheet -- Enzyme Inhibition Constant Data from BindingDB
Found 4 hits for monomerid = 50411656
TargetD(3) dopamine receptor(Homo sapiens (Human))
Glaxosmithkline
Curated by ChEMBL
LigandPNGBDBM50411656(CHEMBL272378)
Affinity DataKi:  200nM. Assay description: Antagonist activity at human dopamine D3 receptor by cell based GTPgammaS binding assay
In DepthDetails ArticlePubMed
TargetD(2) dopamine receptor(Homo sapiens (Human))
Glaxosmithkline
Curated by ChEMBL
LigandPNGBDBM50411656(CHEMBL272378)
Affinity DataKi: >1.00E+3nM. Assay description: Antagonist activity at dopamine D2 receptor by GTPgammaS binding assay
In DepthDetails ArticlePubMed
TargetHistamine H1 receptor(Homo sapiens (Human))
Glaxosmithkline
Curated by ChEMBL
LigandPNGBDBM50411656(CHEMBL272378)
Affinity DataKi: >2.51E+3nM. Assay description: Antagonist activity at histamine H1 receptor by FLIPR assay
In DepthDetails ArticlePubMed
TargetPotassium voltage-gated channel subfamily H member 2(Homo sapiens (Human))
Glaxosmithkline
Curated by ChEMBL
LigandPNGBDBM50411656(CHEMBL272378)
Affinity DataIC50:  2.51E+3nM. Assay description: Displacement of [3H]Dofetilide from human ERG
In DepthDetails ArticlePubMed