BDBM50411722 CHEMBL258333
SMILES OC(=O)[C@H](Cc1ccc(cc1)-c1ccccc1)NC(=O)CS
InChI Key InChIKey=OJDOJGWVKJJLMB-HNNXBMFYSA-N
Data  4 KI
  Tab Delimited (TSV)   2D SDfile   Computed 3D by Vconf -m prep SDfile
Find this compound or compounds like it in BindingDB:
Activity Spreadsheet -- Enzyme Inhibition Constant Data from BindingDB
Found 4 hits for monomerid = 50411722
TargetNeprilysin(Homo sapiens (Human))
Glaxosmithkline
Curated by ChEMBL
LigandPNGBDBM50411722(CHEMBL258333)
Affinity DataKi:  13nM. Assay description: Inhibition of human recombinant NEP by fluorescence assay
In DepthDetails ArticlePubMed
TargetAngiotensin-converting enzyme(Homo sapiens (Human))
Glaxosmithkline
Curated by ChEMBL
LigandPNGBDBM50411722(CHEMBL258333)
Affinity DataKi:  16nM. Assay description: Inhibition of human recombinant ACE by fluorescence assay
In DepthDetails ArticlePubMed
TargetAngiotensin-converting enzyme 2(Homo sapiens (Human))
Glaxosmithkline
Curated by ChEMBL
LigandPNGBDBM50411722(CHEMBL258333)
Affinity DataKi:  320nM. Assay description: Inhibition of human recombinant ACE2 by fluorescence assay
In DepthDetails ArticlePubMed
TargetCarboxypeptidase A1(Homo sapiens (Human))
Glaxosmithkline
Curated by ChEMBL
LigandPNGBDBM50411722(CHEMBL258333)
Affinity DataKi:  1.70E+3nM. Assay description: Inhibition of human recombinant carboxy peptidase A1 by fluorescence assay
In DepthDetails ArticlePubMed