BDBM50411986 CHEMBL260166
SMILES OC[C@H]1O[C@H]([C@H](O)[C@@H]1O)n1cnc2c(NCc3ccc(cc3)[N+]([O-])=O)ncnc12
InChI Key InChIKey=VAQMNFPQRLLRMG-LSCFUAHRSA-N
Data  1 IC50
  Tab Delimited (TSV)   2D SDfile   Computed 3D by Vconf -m prep SDfile
Find this compound or compounds like it in BindingDB:
Activity Spreadsheet -- Enzyme Inhibition Constant Data from BindingDB
Found 1 hit for monomerid = 50411986
TargetEquilibrative nucleoside transporter 1(Homo sapiens (Human))
University Of Tennessee Health Science Center
Curated by ChEMBL
LigandPNGBDBM50411986(CHEMBL260166)
Affinity DataIC50:  27.5nM. Assay description: Binding affinity to ENT1 transporter
In DepthDetails ArticlePubMed