BDBM50412009 CHEMBL259301
SMILES OC[C@H]1O[C@H]([C@H](O)[C@@H]1O)n1cnc2c(CSc3cccc(I)c3)ncnc12
InChI Key InChIKey=AZIWVNOWTWZANG-DNNBLBMLSA-N
Data  1 IC50
  Tab Delimited (TSV)   2D SDfile   Computed 3D by Vconf -m prep SDfile
Find this compound or compounds like it in BindingDB:
Activity Spreadsheet -- Enzyme Inhibition Constant Data from BindingDB
Found 1 hit for monomerid = 50412009
TargetEquilibrative nucleoside transporter 1(Homo sapiens (Human))
University Of Tennessee Health Science Center
Curated by ChEMBL
LigandPNGBDBM50412009(CHEMBL259301)
Affinity DataIC50:  245nM. Assay description: Binding affinity to ENT1 transporter
In DepthDetails ArticlePubMed