BDBM50412263 CHEMBL517676
SMILES COc1cc(O)c2c(c1)oc(cc2=O)-c1cc(OC)c(O)cc1OC
InChI Key InChIKey=JICVTWZGKGGTFR-UHFFFAOYSA-N
Data  1 IC50
  Tab Delimited (TSV)   2D SDfile   Computed 3D by Vconf -m prep SDfile
Find this compound or compounds like it in BindingDB:
Activity Spreadsheet -- Enzyme Inhibition Constant Data from BindingDB
Found 1 hit for monomerid = 50412263
TargetAldo-keto reductase family 1 member B1(Rattus norvegicus)
Inifta (Unlp, Cct La Plata-Conicet)
Curated by ChEMBL
LigandPNGBDBM50412263(CHEMBL517676)
Affinity DataIC50:  1.00E+6nM. Assay description: Inhibition of rat lens aldose reductase
In DepthDetails ArticlePubMed