BDBM50412272 CIRSILENEOL
SMILES COc1cc(ccc1O)-c1cc(=O)c2c(O)c(OC)c(OC)cc2o1
InChI Key InChIKey=VKOSQMWSWLZQPA-UHFFFAOYSA-N
Data  1 IC50
  Tab Delimited (TSV)   2D SDfile   Computed 3D by Vconf -m prep SDfile
Find this compound or compounds like it in BindingDB:
Activity Spreadsheet -- Enzyme Inhibition Constant Data from BindingDB
Found 1 hit for monomerid = 50412272
TargetAldo-keto reductase family 1 member B1(Rattus norvegicus)
Inifta (Unlp, Cct La Plata-Conicet)
Curated by ChEMBL
LigandPNGBDBM50412272(CIRSILENEOL)
Affinity DataIC50:  6.76E+3nM. Assay description: Inhibition of rat lens aldose reductase
In DepthDetails ArticlePubMed