BDBM50412289 CHEMBL162550
SMILES COc1c(O)cc(O)c2c1oc(-c1ccc(O)c(O)c1)c(OC)c2=O
InChI Key InChIKey=RRYQDECFPVYHLR-UHFFFAOYSA-N
Data  1 IC50
  Tab Delimited (TSV)   2D SDfile   Computed 3D by Vconf -m prep SDfile
Find this compound or compounds like it in BindingDB:
Activity Spreadsheet -- Enzyme Inhibition Constant Data from BindingDB
Found 1 hit for monomerid = 50412289
TargetAldo-keto reductase family 1 member B1(Rattus norvegicus)
Inifta (Unlp, Cct La Plata-Conicet)
Curated by ChEMBL
LigandPNGBDBM50412289(CHEMBL162550)
Affinity DataIC50:  240nM. Assay description: Inhibition of rat lens aldose reductase
In DepthDetails ArticlePubMed