BDBM50412553 CHEMBL479824
SMILES CCNC(=O)NC1C[C@H]2CC[C@]1(CS(=O)(=O)N1CCN(CC1)c1ccc(cn1)C(F)(F)F)C2(C)C
InChI Key InChIKey=XZPIHDUKWZLYNQ-GOWJYDFKSA-N
Data  1 IC50
  Tab Delimited (TSV)   2D SDfile   Computed 3D by Vconf -m prep SDfile
Find this compound or compounds like it in BindingDB:
Activity Spreadsheet -- Enzyme Inhibition Constant Data from BindingDB
Found 1 hit for monomerid = 50412553
TargetC-X-C chemokine receptor type 3(Homo sapiens (Human))
Glaxosmithkline
Curated by ChEMBL
LigandPNGBDBM50412553(CHEMBL479824)
Affinity DataIC50:  794nM. Assay description: Antagonist activity at human recombinant CXCR3 receptor expressed in CHO-K1 cells assessed as human IP10-induced calcium flux by FLIPR assay
In DepthDetails ArticlePubMed