BDBM50412560 CHEMBL464065
SMILES C[C@H]1CN(CCN1c1ncc(cc1F)C(F)(F)F)S(=O)(=O)C[C@]12CC[C@H](C[C@H]1O)C2(C)C
InChI Key InChIKey=PMSFEOUVENKQAA-AADOQKPJSA-N
Data  2 IC50
  Tab Delimited (TSV)   2D SDfile   Computed 3D by Vconf -m prep SDfile
Find this compound or compounds like it in BindingDB:
Activity Spreadsheet -- Enzyme Inhibition Constant Data from BindingDB
Found 2 hits for monomerid = 50412560
TargetC-X-C chemokine receptor type 3(Homo sapiens (Human))
Glaxosmithkline
Curated by ChEMBL
LigandPNGBDBM50412560(CHEMBL464065)
Affinity DataIC50:  63.1nM. Assay description: Antagonist activity at human recombinant CXCR3 receptor expressed in CHO-K1 cells assessed as human IP10-induced calcium flux by FLIPR assay
In DepthDetails ArticlePubMed
TargetC-X-C chemokine receptor type 3(Mus musculus)
Glaxosmithkline
Curated by ChEMBL
LigandPNGBDBM50412560(CHEMBL464065)
Affinity DataIC50:  1.58E+3nM. Assay description: Antagonist activity at mouse recombinant CXCR3 expressed in human U2OS cells
In DepthDetails ArticlePubMed