BDBM50412794 CHEMBL33716
SMILES CCCCCCCCCCCCCCCC(=O)NCCBr
InChI Key InChIKey=VZONQUSMLYLWIQ-UHFFFAOYSA-N
Data  1 IC50
  Tab Delimited (TSV)   2D SDfile   Computed 3D by Vconf -m prep SDfile
Find this compound or compounds like it in BindingDB:
Activity Spreadsheet -- Enzyme Inhibition Constant Data from BindingDB
Found 1 hit for monomerid = 50412794
TargetFatty-acid amide hydrolase 1(Homo sapiens (Human))
Johnson & Johnson Pharmaceutical Research And Development
Curated by ChEMBL
LigandPNGBDBM50412794(CHEMBL33716)
Affinity DataIC50:  3.55E+3nM. Assay description: Inhibition of FAAH
In DepthDetails ArticlePubMed