BDBM50412921 CHEMBL473442
SMILES Clc1cccc(c1)-c1ccc(cc1)C(=O)N(CC1CC1)CC1CCCO1
InChI Key InChIKey=BYXAARAKDDDQLH-UHFFFAOYSA-N
Data  1 KI
  Tab Delimited (TSV)   2D SDfile   Computed 3D by Vconf -m prep SDfile
Find this compound or compounds like it in BindingDB:
Activity Spreadsheet -- Enzyme Inhibition Constant Data from BindingDB
Found 1 hit for monomerid = 50412921
TargetOxytocin receptor(Homo sapiens (Human))
Glaxosmithkline
Curated by ChEMBL
LigandPNGBDBM50412921(CHEMBL473442)
Affinity DataKi:  7.94nM. Assay description: Antagonist activity at human oxytocin receptor expressed in CHO cells by FLIPR assay
In DepthDetails ArticlePubMed